{"text_format":"1","workbook":"xlsx","n_sheets":11,"sheets":["Results","General Assumptions","Infrastructure Table","Cashflow","Cashflows","Calculations","S&U Summary","Line of Credit","Term Loan","Term Loan (2)","Sheet1"],"not_rendered":{"charts":0,"images":1,"macros":1,"external_links":0,"defined_names":228,"comments":0,"pivot_tables":0},"unopened":[],"bounds":{"document_bytes":16777216,"sheet_cells":100000,"rows_first":2000,"rows_last":500,"rows_between":2000,"halvings":0,"cell_chars":16384,"cell_head_chars":4096},"cells_cut":0,"cells_raw":0,"read":"whole","date_system":"1900"}

{"sheet":"Results","index":0,"n_rows":22,"n_cols":4,"rows_kept":22,"cut":false,"hidden":false,"merged":[[2,1,2,3]]}
["Results"]
[]
[null,"Project Results - Cashflow - 15yr Project Term"]
[]
[null,"Metric",null,"Result"]
[null,"Capital Investment",null,{"$f":"Cashflows!V25","v":-266419.5323699452}]
[]
[null,"Operations"]
[null,"Total  Revenue",null,{"$f":"Cashflows!V38","v":12725960.655926311}]
[null,"Total Expenses",null,{"$f":"Cashflows!V71","v":-10803312.840511244}]
{"$rows_left_out":13}
{"sheet":"General Assumptions","index":1,"n_rows":60,"n_cols":22,"rows_kept":60,"cut":false,"hidden":false,"merged":[[2,9,2,11],[35,14,35,21],[89,1,89,3],[96,1,96,3],[2,1,2,3],[2,5,2,7],[24,5,24,7],[2,14,2,19]]}
[{"$f":"C6&\" Inputs and Parameters\"","v":" Inputs and Parameters"}]
[]
[null,"General Assumptions",null,null,null,"Operating Expenses",null,null,null,"Sources and Uses",null,null,null,null,"Busines Infrastructure "]
[]
[null,"Project Description",null,"Input Value",null,"Equipment Costs",null,"Input Value",null,"Pre-Operations:",null,"$ Amt",null,null,null,null,"Equipment Cost","Equip Cost","O&M Expense","O&M"]
[null,"Name",null,"Project LPG",null,"Cylinder",null,null,null,"Sources",null,null,null,null,null,"Type","(per unit installed)","Inflation","(per unit/yr)","Inflation"]
[null,"Description",null,"Country Y LPG Project",null,"Cost per acquisition","$",12,null,"Equity Investment ",null,{"$f":"investment_amount_A","v":50000},{"$f":"IF((SUM(L14:L27)-L7)<0,\"check\",\"OK\")","v":"OK"},null,null,"Storage",5000,1.4999999999999999E-2,2500,1.4999999999999999E-2]
[null,"Participant",null,"Company X",null,"estimated life","yrs",10,null,"Term Loan",null,{"$f":"MAX(L29-(L7+L9),0)","v":38000},null,null,null,"Refueling Stations",7500,1.2500000000000001E-2,1250,1.2500000000000001E-2]
[null,null,null,null,null,"% replaced per year","%",0.05,null,"Line of Credit",null,{"$f":"L47","v":321865.49057072133},null,null,null,"Transportation",9000,2.5000000000000001E-2,3000,2.5000000000000001E-2]
[null,"Customer Acquisition",null,"Input Value",null,"Burner",null,null,null,"TOTAL",null,{"$f":"SUM(L7:L9)","v":409865.49057072133},null,null,null,"Misc. Infrastructure",2500,0.01,500,0.01]
{"$rows_left_out":51}
{"sheet":"Infrastructure Table","index":2,"n_rows":67,"n_cols":16,"rows_kept":67,"cut":false,"hidden":true,"merged":[[48,1,48,15]]}
[{"$f":"'General Assumptions'!D6&\" Infrastructure Planning Table\"","v":"Project LPG Infrastructure Planning Table"}]
[]
[]
[]
[]
[]
[]
[]
[]
[]
{"$rows_left_out":58}
{"sheet":"Cashflow","index":3,"n_rows":107,"n_cols":20,"rows_kept":107,"cut":false,"hidden":true,"merged":[[4,4,4,19]]}
[{"$f":"'General Assumptions'!D7","v":"Country Y LPG Project"}]
["Summary of Revenue and Expenditures"]
["Annual Calculation"]
["All numbers based on USD"]
[null,null,null,null,"Year"]
["Line ",null,null,0,{"$f":"D6+1","v":1},{"$f":"E6+1","v":2},3,4,5,6,7,8,9,10,11,12,13,14,15,"Total"]
[]
[1,"INVESTMENT"]
[{"$f":"A8+1","v":2},"Sources"]
[3,"Equity"]
{"$rows_left_out":98}
{"sheet":"Cashflows","index":4,"n_rows":130,"n_cols":22,"rows_kept":130,"cut":false,"hidden":false,"merged":[[4,6,4,21]]}
[null,{"$f":"'General Assumptions'!D7","v":"Country Y LPG Project"}]
[null,"Statement of Cashflows"]
[null,"Annual Calculation"]
[null,"All numbers based on USD"]
[null,null,null,null,null,null,"Year"]
["Line ",null,null,null,null,0,{"$f":"F6+1","v":1},{"$f":"G6+1","v":2},3,4,5,6,7,8,9,10,11,12,13,14,15,"Total"]
[]
[1,"INVESTMENT"]
[null,null,"CapEx"]
[{"$f":"#REF!+1","v":{"$error":"#REF!"}},null,{"$f":"'General Assumptions'!J18","v":"Office (capitalized portion)"},null,null,{"$f":"-'General Assumptions'!L18*IF(F$6=0,1,0)","v":-7000},null,null,null,null,null,null,null,null,null,null,null,null,null,null,null,{"$f":"SUM(F10:U10)","v":-7000}]
{"$rows_left_out":121}
{"sheet":"Calculations","index":5,"n_rows":71,"n_cols":19,"rows_kept":71,"cut":false,"hidden":true,"merged":[[24,3,24,18],[3,3,3,18],[47,3,47,18]]}
[{"$f":"'General Assumptions'!C6&\" Calculation Table\"","v":" Calculation Table"}]
[]
[null,"Customer Adoption"]
[null,null,null,"Year"]
[null,null,null,1,{"$f":"D5+1","v":2},{"$f":"E5+1","v":3},{"$f":"F5+1","v":4},{"$f":"G5+1","v":5},{"$f":"H5+1","v":6},{"$f":"I5+1","v":7},{"$f":"J5+1","v":8},{"$f":"K5+1","v":9},{"$f":"L5+1","v":10},{"$f":"M5+1","v":11},{"$f":"N5+1","v":12},{"$f":"O5+1","v":13},{"$f":"P5+1","v":14},{"$f":"Q5+1","v":15},"Total"]
[null,"Customer Count"]
[null,"Customers, Annual",null,{"$f":"SUMIF('General Assumptions'!$B$12:$B$26,D$5,customer_acquisition_table)","v":400},{"$f":"SUMIF('General Assumptions'!$B$12:$B$26,E$5,customer_acquisition_table)","v":400},{"$f":"SUMIF('General Assumptions'!$B$12:$B$26,F$5,customer_acquisition_table)","v":600},{"$f":"SUMIF('General Assumptions'!$B$12:$B$26,G$5,customer_acquisition_table)","v":500},{"$f":"SUMIF('General Assumptions'!$B$12:$B$26,H$5,customer_acquisition_table)","v":500},{"$f":"SUMIF('General Assumptions'!$B$12:$B$26,I$5,customer_acquisition_table)","v":500},{"$f":"SUMIF('General Assumptions'!$B$12:$B$26,J$5,customer_acquisition_table)","v":400},{"$f":"SUMIF('General Assumptions'!$B$12:$B$26,K$5,customer_acquisition_table)","v":400},{"$f":"SUMIF('General Assumptions'!$B$12:$B$26,L$5,customer_acquisition_table)","v":300},{"$f":"SUMIF('General Assumptions'!$B$12:$B$26,M$5,customer_acquisition_table)","v":0},{"$f":"SUMIF('General Assumptions'!$B$12:$B$26,N$5,customer_acquisition_table)","v":0},{"$f":"SUMIF('General Assumptions'!$B$12:$B$26,O$5,customer_acquisition_table)","v":0},{"$f":"SUMIF('General Assumptions'!$B$12:$B$26,P$5,customer_acquisition_table)","v":0},{"$f":"SUMIF('General Assumptions'!$B$12:$B$26,Q$5,customer_acquisition_table)","v":0},{"$f":"SUMIF('General Assumptions'!$B$12:$B$26,R$5,customer_acquisition_table)","v":0},{"$f":"SUM(D7:R7)","v":4000}]
[null,"Customers, Cumulative",null,{"$f":"SUM($D$7:D7)","v":400},{"$f":"SUM($D$7:E7)","v":800},{"$f":"SUM($D$7:F7)","v":1400},{"$f":"SUM($D$7:G7)","v":1900},{"$f":"SUM($D$7:H7)","v":2400},{"$f":"SUM($D$7:I7)","v":2900},{"$f":"SUM($D$7:J7)","v":3300},{"$f":"SUM($D$7:K7)","v":3700},{"$f":"SUM($D$7:L7)","v":4000},{"$f":"SUM($D$7:M7)","v":4000},{"$f":"SUM($D$7:N7)","v":4000},{"$f":"SUM($D$7:O7)","v":4000},{"$f":"SUM($D$7:P7)","v":4000},{"$f":"SUM($D$7:Q7)","v":4000},{"$f":"SUM($D$7:R7)","v":4000},"n/a"]
[]
[null,"Cylinder Deployment Count"]
{"$rows_left_out":62}
{"sheet":"S&U Summary","index":6,"n_rows":42,"n_cols":22,"rows_kept":42,"cut":false,"hidden":false,"merged":[[4,6,4,21]]}
[null,{"$f":"'General Assumptions'!D7","v":"Country Y LPG Project"}]
[null,"Summary of Investment Sources & Uses "]
[null,"Annual Calculation"]
[null,"All numbers based on USD"]
[null,null,null,null,null,null,"Year"]
["Line ",null,null,null,null,0,{"$f":"F6+1","v":1},{"$f":"G6+1","v":2},3,4,5,6,7,8,9,10,11,12,13,14,15,"Total"]
[]
[1,"INVESTMENT SOURCES & USES SUMMARY"]
[{"$f":"A8+1","v":2},null,"Sources"]
[{"$f":"#REF!+1","v":{"$error":"#REF!"}},null,"Equity Investment",null,null,{"$f":"Cashflows!F79","v":50000},{"$f":"Cashflows!G79","v":0},{"$f":"Cashflows!H79","v":0},{"$f":"Cashflows!I79","v":0},{"$f":"Cashflows!J79","v":0},{"$f":"Cashflows!K79","v":0},{"$f":"Cashflows!L79","v":0},{"$f":"Cashflows!M79","v":0},{"$f":"Cashflows!N79","v":0},{"$f":"Cashflows!O79","v":0},{"$f":"Cashflows!P79","v":0},{"$f":"Cashflows!Q79","v":0},{"$f":"Cashflows!R79","v":0},{"$f":"Cashflows!S79","v":0},{"$f":"Cashflows!T79","v":0},{"$f":"Cashflows!U79","v":0},{"$f":"SUM(F10:U10)","v":50000}]
{"$rows_left_out":33}
{"sheet":"Line of Credit","index":7,"n_rows":32,"n_cols":22,"rows_kept":32,"cut":false,"hidden":false,"merged":[[4,6,4,21]]}
[null,{"$f":"'General Assumptions'!D7","v":"Country Y LPG Project"}]
[null,"Line of Credit Calculation Summary"]
[null,"Annual Calculation"]
[null,"All numbers based on USD"]
[null,null,null,null,null,null,"Year"]
["Line ",null,null,null,null,0,{"$f":"F6+1","v":1},{"$f":"G6+1","v":2},3,4,5,6,7,8,9,10,11,12,13,14,15,"Total"]
[]
[1,"LINE OF CREDIT"]
[{"$f":"#REF!+1","v":{"$error":"#REF!"}},null,"Line of Credit (revolving loan)"]
[null,null,"Sizing"]
{"$rows_left_out":23}
{"sheet":"Term Loan","index":8,"n_rows":41,"n_cols":14,"rows_kept":41,"cut":false,"hidden":false,"merged":[[6,0,6,5],[6,8,6,13]]}
[{"$f":"'General Assumptions'!D6&\" Term Loan Table\"","v":"Project LPG Term Loan Table"}]
[]
[]
["Term Loan Tables"]
[]
[]
["Term Loan Debt Service - Mortgage Style",null,null,null,null,null,null,null,"Term Loan Debt Service - Straight-Line Principal"]
["Year","Begin","Principal","Interest","Debt Service","End",null,null,"Year","Begin","Principal","Interest","Debt Service","End"]
[0,null,null,null,null,{"$f":"loan_amount_A*IF(loan_amort_A=\"Mortgage\",1,0)","v":38000},null,null,0,null,null,null,null,{"$f":"loan_amount_A*IF(loan_amort_A=\"Mortgage\",0,1)","v":0}]
[1,{"$f":"F9","v":38000},{"$f":"E10-D10","v":6477.3452735397914},{"$f":"B10*loan_rate_A","v":3040},{"$f":"-PMT(loan_rate_A,loan_term_A,loan_amount_A)*IF(A10>loan_term_A,0,1)*IF(loan_amort_A=\"Mortgage\",1,0)","v":9517.3452735397914},{"$f":"B10-C10","v":31522.654726460209},null,null,1,{"$f":"N9","v":0},{"$f":"(loan_amount_A/loan_term_A)*IF(A10>loan_term_A,0,1)*IF(loan_amort_A=\"Mortgage\",0,1)","v":0},{"$f":"J10*loan_rate_A","v":0},{"$f":"K10+L10","v":0},{"$f":"J10-K10","v":0}]
{"$rows_left_out":32}
{"sheet":"Term Loan (2)","index":9,"n_rows":41,"n_cols":42,"rows_kept":41,"cut":false,"hidden":true,"merged":[[6,1,6,4],[6,11,6,13],[6,20,6,22],[6,29,6,31],[6,38,6,40]]}
[{"$f":"'General Assumptions'!D6&\" Term Loan Table\"","v":"Project LPG Term Loan Table"}]
[]
[]
["Loan A",null,null,null,null,null,null,null,null,"Loan B",null,null,null,null,null,null,null,null,"Loan C",null,null,null,null,null,null,null,null,"Loan D",null,null,null,null,null,null,null,null,"Loan E"]
[]
[]
[null,"Term Loan Debt Service",null,null,null,null,null,null,null,null,null,"Loan B Debt Service",null,null,null,null,null,null,null,null,"Loan C Debt Service",null,null,null,null,null,null,null,null,"Loan D Debt Service",null,null,null,null,null,null,null,null,"Loan E Debt Service"]
["Year","Begin","Principal","Interest","Debt Service","End",null,null,null,"Year",{"$f":"B8","v":"Begin"},{"$f":"C8","v":"Principal"},"Interest","Debt Service","End",null,null,null,"Year",{"$f":"K8","v":"Begin"},{"$f":"L8","v":"Principal"},"Interest","Debt Service","End",null,null,null,"Year",{"$f":"T8","v":"Begin"},{"$f":"U8","v":"Principal"},"Interest","Debt Service","End",null,null,null,"Year",{"$f":"AC8","v":"Begin"},{"$f":"AD8","v":"Principal"},"Interest","Debt Service","End"]
[null,null,null,null,null,{"$f":"loan_amount_A","v":38000},null,null,null,null,null,null,null,null,{"$f":"loan_amount_B","v":{"$error":"#REF!"}},null,null,null,null,null,null,null,null,{"$f":"loan_amount_C","v":{"$error":"#REF!"}},null,null,null,null,null,null,null,null,{"$f":"loan_amount_D","v":{"$error":"#REF!"}},null,null,null,null,null,null,null,null,{"$f":"loan_amount_E","v":{"$error":"#REF!"}}]
[1,{"$f":"F9","v":38000},{"$f":"IF(AND((A10>=loan_year_A),(A10<=(loan_year_A+loan_term_A)),loan_switch_A>0),IF(loan_amort_A=0,(loan_amount_A/loan_term_A),PPMT(loan_rate_A,(A10-loan_year_A+1),loan_term_A,-loan_amount_A)),0)","v":{"$error":"#REF!"}},{"$f":"(D11+(C10*loan_rate_A))*($A10>=loan_year_A)*($A10<=(loan_year_A+loan_term_A))","v":{"$error":"#REF!"}},{"$f":"D10+C10","v":{"$error":"#REF!"}},{"$f":"B10-C10","v":{"$error":"#REF!"}},null,null,null,1,{"$f":"O9","v":{"$error":"#REF!"}},{"$f":"IF(AND((J10>=loan_year_B),(J10<(loan_year_B+loan_term_B)),loan_switch_B>0),IF(loan_amort_B=0,(loan_amount_B/loan_term_B),PPMT(loan_rate_B,(J10-loan_year_B+1),loan_term_B,-loan_amount_B)),0)","v":{"$error":"#REF!"}},{"$f":"(M11+(L10*loan_rate_B))*(J10>=loan_year_B)*(J10<(loan_year_B+loan_term_B))","v":{"$error":"#REF!"}},{"$f":"M10+L10","v":{"$error":"#REF!"}},{"$f":"K10-L10","v":{"$error":"#REF!"}},null,null,null,1,{"$f":"X9","v":{"$error":"#REF!"}},{"$f":"IF(AND((S10>=loan_year_C),(S10<(loan_year_C+loan_term_C)),loan_switch_C>0),IF(loan_amort_C=0,(loan_amount_C/loan_term_C),PPMT(loan_rate_C,(S10-loan_year_C+1),loan_term_C,-loan_amount_C)),0)","v":{"$error":"#REF!"}},{"$f":"(V11+(U10*loan_rate_C))*(S10>=loan_year_C)*(S10<(loan_year_C+loan_term_C))","v":{"$error":"#REF!"}},{"$f":"V10+U10","v":{"$error":"#REF!"}},{"$f":"T10-U10","v":{"$error":"#REF!"}},null,null,null,1,{"$f":"AG9","v":{"$error":"#REF!"}},{"$f":"IF(AND((AB10>=loan_year_D),(AB10<(loan_year_D+loan_term_D)),loan_switch_D>0),IF(loan_amort_D=0,(loan_amount_D/loan_term_D),PPMT(loan_rate_D,(AB10-loan_year_D+1),loan_term_D,-loan_amount_D)),0)","v":{"$error":"#REF!"}},{"$f":"(AE11+(AD10*loan_rate_D))*(AB10>=loan_year_D)*(AB10<(loan_year_D+loan_term_D))","v":{"$error":"#REF!"}},{"$f":"AE10+AD10","v":{"$error":"#REF!"}},{"$f":"AC10-AD10","v":{"$error":"#REF!"}},null,null,null,1,{"$f":"AP9","v":{"$error":"#REF!"}},{"$f":"IF(AND((AK10>=loan_year_E),(AK10<(loan_year_E+loan_term_E)),loan_switch_E>0),IF(loan_amort_E=0,(loan_amount_E/loan_term_E),PPMT(loan_rate_E,(AK10-loan_year_E+1),loan_term_E,-loan_amount_E)),0)","v":{"$error":"#REF!"}},{"$f":"(AN11+(AM10*loan_rate_E))*(AK10>=loan_year_E)*(AK10<(loan_year_E+loan_term_E))","v":{"$error":"#REF!"}},{"$f":"AN10+AM10","v":{"$error":"#REF!"}},{"$f":"AL10-AM10","v":{"$error":"#REF!"}}]
{"$rows_left_out":32}
{"sheet":"Sheet1","index":10,"n_rows":0,"n_cols":0,"rows_kept":0,"cut":false,"hidden":true,"merged":[]}